{"text_format":"3","workbook":"xlsx","n_sheets":4,"sheets":["附件二","附件三","附件四","附件五"],"not_rendered":{"external_links":1},"read":"whole","date_system":"1900"}

{"sheet":"附件二","index":0,"n_rows":35,"n_cols":11,"rows_kept":35,"merged":[[0,0,0,10],[1,0,1,10],[2,0,2,3],[3,0,3,9],[3,10,4,10],[5,0,8,0],[10,1,10,10],[11,0,11,10],[12,0,12,10],[13,0,13,10],[14,0,14,3],[15,4,15,5],[15,6,15,7],[15,8,15,9],[16,4,16,5],[16,6,16,7],[16,8,16,9],[17,0,20,0],[17,1,20,1],[17,2,20,2],[17,3,20,3],[17,4,20,5],[17,6,20,7],[17,8,20,9],[17,10,20,10],[21,4,21,5],[21,6,21,7],[21,8,21,9],[22,4,22,5],[22,6,22,7],[22,8,22,9],[23,4,23,5],[23,6,23,7],[23,8,23,9],[25,0,25,3],[26,4,26,5],[26,6,26,7],[26,8,26,9],[27,4,27,5],[27,6,27,7],[27,8,27,9],[28,0,31,0],[28,1,31,1],[28,2,31,2],[28,3,31,3],[28,4,31,5],[28,6,31,7],[28,8,31,9],[28,10,31,10],[32,4,32,5],[32,6,32,7],[32,8,32,9],[33,4,33,5],[33,6,33,7],[33,8,33,9],[34,4,34,5],[34,6,34,7],[34,8,34,9]]}
["附件二"]
["泸州市城投项目资产经营管理公司（储油罐）采购报价表（包号一）"]
["表1：加油站SF双层储油罐设备价格表"]
["项  目",{"$nulls":9},"备注说明"]
["设备名称","型号规格","内罐材质","外罐材质","数量","单价（元）","交货周期","使用寿命","质保期","特殊承诺"]
["加油站SF双层储油罐","20 m³       ","Q235B","玻璃钢"]
[null,"30 m³","Q235B","玻璃钢"]
[]
[]
[]
["总价（元）"]
["注："]
[]
[]
["表2：20 m³SF双层储油罐分项价格表"]
["序号","名称","材质或型号","计量单位位","数量",null,"单价（元）",null,"总价（元）",null,"备注"]
[1,"内层罐罐体","Q235B-8","个"]
[2,"内层罐封头","Q235B-8","个"]
[]
[]
[]
[3,"外层罐罐体","玻璃钢","台"]
[4,"抱带（含橡胶垫）","Q235B","套"]
[5,"合计"]
[]
["表3：30 m³SF双层储油罐分项价格表"]
["序号","名称","材质或型号","计量单位位","数量",null,"单价（元）",null,"总价（元）",null,"备注"]
[1,"内层罐罐体","Q235B-8","个"]
[2,"内层罐封头","Q235B-8","个"]
[]
[]
[]
[3,"外层罐罐体","玻璃钢","台"]
[4,"抱带（含橡胶垫）","Q235B","套"]
[5,"合计"]

{"sheet":"附件三","index":1,"n_rows":15,"n_cols":7,"rows_kept":15,"merged":[[1,0,1,6]]}
["附件三"]
[" 泸州市城投项目资产经营管理有限公司操作井及加油机地槽设备\n采购报价表（包号二）"]
["序号","产品编号","产品名称","单位","合同量","单价                 (元/米、件)","价格合计                    （元）"]
[1,"操作井及加油机地槽设备"]
[2,"DC1200","加油机底槽1222mm*640mm","件",{"v":6,"d":"6.00"}]
[3,"FibreECO","FibreECO 人井直径1400mm","件",{"v":9,"d":"9.00"}]
[4,"DEB-0751","DEB-0751DN20穿线管密封套，入口密封套（DN20）","件",{"v":66,"d":"66.00"}]
[5,"SBKC-435","紧急切断阀固定支架","件",{"v":12,"d":"12.00"}]
[6,"KP TM125/90","适用于外径125/110/90mm管道，螺口固定，无需螺拴固定","套",{"v":1,"d":"1.00"}]
[7,"KP M125/90H","适用于外径125/110/90mm管道，螺口固定，无需螺拴固定","件",{"v":1,"d":"1.00"}]
[8,"KP TM75/54","入井密封套","套",{"v":6,"d":"6.00"}]
[9,"KP M75/54H","入井密封套 ","件",{"v":6,"d":"6.00"}]
[10,"渗漏检测总价"]
[11,"技术服务费",{"$nulls":3},"%"]
[12,"总价格"]

{"sheet":"附件四","index":2,"n_rows":48,"n_cols":7,"rows_kept":48,"merged":[[1,0,1,6]]}
["附件四"]
["   泸州市城投项目资产经营管理有限公司复合管道\n    采购报价表（包号三）"]
["序号","产品编号","产品名称","单位","合同量","单价                 (元/米、件)","价格合计                    （元）"]
[1,"KP 75/63SCEC50",{"$f":"VLOOKUP(B4,[1]Sheet1!$B:$C,2,0)","v":"双层管道（DN50）"},"米",{"v":550,"d":"550.00"}]
[2,"KP 75/63SCEC6",{"$f":"VLOOKUP(B5,[1]Sheet1!$B:$C,2,0)","v":"双层管道（DN50）"},"米",{"v":23.2,"d":"23.20"}]
[3,"KP 2-75/63SC",{"$f":"VLOOKUP(B6,[1]Sheet1!$B:$C,2,0)","v":"双层焊接接头"},"件",{"v":45,"d":"45.00"}]
[4,"KP 8-75/63SCEC02",{"$f":"VLOOKUP(B7,[1]Sheet1!$B:$C,2,0)","v":"双层三通"},"件",{"v":7,"d":"7.00"}]
[5,"KP 3-75/63SCEC",{"$f":"VLOOKUP(B8,[1]Sheet1!$B:$C,2,0)","v":"双层弯头"},"件",{"v":6,"d":"6.00"}]
[6,"KP TM75/63SC2A",{"$f":"VLOOKUP(B9,[1]Sheet1!$B:$C,2,0)","v":"带密封终端焊接接头"},"件",{"v":12,"d":"12.00"}]
[7,"KP T75/63SC2A",{"$f":"VLOOKUP(B10,[1]Sheet1!$B:$C,2,0)","v":"终端转换接头"},"件",{"v":12,"d":"12.00"}]
[8,"KP CC-63",{"$f":"VLOOKUP(B11,[1]Sheet1!$B:$C,2,0)","v":"导静电插件（DN50）"},"件",{"v":45,"d":"45.00"}]
[9,"KP 23-63EC",{"$f":"VLOOKUP(B12,[1]Sheet1!$B:$C,2,0)","v":"90度单层弯头（DN50）"},"件",{"v":6,"d":"6.00"}]
[10,"KP TM75/54","入井密封套","套",{"v":13,"d":"13.00"}]
[11,"KP M75/54H","入井密封套 ","件",{"v":13,"d":"13.00"}]
[12,"KP C14-63/54M","1½\"外螺纹转换铜接头，适用于外径63mm管道","件",{"v":12,"d":"12.00"}]
[13,"KP C14-F5-63","法兰压紧式转换接头套件，管径63mm","件",{"v":6,"d":"6.00"}]
[14,"输油管道材料价格"]
[15,"技术服务费",{"$nulls":3},"%"]
[16,"总价格"]
[17]
[18,"卸油管道材料"]
[19,"KP 110EC6",{"$f":"VLOOKUP(B22,[1]Sheet1!$B:$C,2,0)","v":"单层管道（DN100）"},"米",{"v":92.8,"d":"92.80"}]
[20,"KP 2-110",{"$f":"VLOOKUP(B23,[1]Sheet1!$B:$C,2,0)","v":"焊接接头"},"件",{"v":48,"d":"48.00"}]
[21,"KP 3-110FCL",{"$f":"VLOOKUP(B24,[1]Sheet1!$B:$C,2,0)","v":"90度弯头"},"件",{"v":13,"d":"13.00"}]
[22,"KP 4-110FC",{"$f":"VLOOKUP(B25,[1]Sheet1!$B:$C,2,0)","v":"45度弯头"},"件",{"v":6,"d":"6.00"}]
[23,"KP 8-110FC03",{"$f":"VLOOKUP(B26,[1]Sheet1!$B:$C,2,0)","v":"三通"},"件",{"v":2,"d":"2.00"}]
[24,"KP CC-110",{"$f":"VLOOKUP(B27,[1]Sheet1!$B:$C,2,0)","v":"导静电插件（DN100）"},"件",{"v":48,"d":"48.00"}]
[25,"KP TM125/90","适用于外径125/110/90mm管道，螺口固定，无需螺拴固定","套",{"v":8,"d":"8.00"}]
[26,"KP M125/90H","适用于外径125/110/90mm管道，螺口固定，无需螺拴固定","套",{"v":8,"d":"8.00"}]
[27,"KP C14-F5-110","刚朔转换接头及法兰","套",{"v":14,"d":"14.00"}]
[28,"卸油总价"]
[29,"技术服务费",{"$nulls":3},"%"]
[30,"总价格"]
[31]
[32,"放空管材料"]
[33,"KP 63EC6",{"$f":"VLOOKUP(B36,[1]Sheet1!$B:$C,2,0)","v":"单层管道（DN50）"},"米",{"v":40.6,"d":"40.60"}]
[34,"KP 2-63",{"$f":"VLOOKUP(B37,[1]Sheet1!$B:$C,2,0)","v":"焊接接头"},"件",{"v":34,"d":"34.00"}]
[35,"KP CC-63",{"$f":"VLOOKUP(B38,[1]Sheet1!$B:$C,2,0)","v":"导静电插件（DN50）"},"件",{"v":34,"d":"34.00"}]
[36,"KP 23-63EC",{"$f":"VLOOKUP(B39,[1]Sheet1!$B:$C,2,0)","v":"90度单层弯头（DN50）"},"件",{"v":9,"d":"9.00"}]
[37,"KP 28-63EC",{"$f":"VLOOKUP(B40,[1]Sheet1!$B:$C,2,0)","v":"单层三通（DN50）"},"件",{"v":3,"d":"3.00"}]
[38,"KP TM75/54","入井密封套","套",{"v":5,"d":"5.00"}]
[39,"KP M75/54H","入井密封套 ","件",{"v":5,"d":"5.00"}]
[40,"KP C14-F5-63","法兰压紧式转换接头套件，管径63mm","件",{"v":9,"d":"9.00"}]
[41,"放空管总价"]
[42,"技术服务费",{"$nulls":3},"%"]
[43,"总价格"]
[44]
[45,"总合计价格"]

{"sheet":"附件五","index":3,"n_rows":11,"n_cols":8,"rows_kept":11,"merged":[[1,0,1,7],[9,0,9,6],[10,0,10,6]]}
["附件五"]
["泸州市城投项目资产经营管理有限公司三合一液位仪系统及潜油泵\n    采购报价表（包号四）"]
["序号","物资名称","型号","单位","数量","单价","合计","品牌"]
[1,"双层罐测漏传感器",null,"罐",5]
[2,"双层管测漏传感器",null,"条",5]
[3,"控制台","TLS-450PLUS","台",1]
[4,"探棒","Mag-1","根",5]
[5,"浮子","3寸","个",5]
[6,"潜油泵","1.5P","台",6]
["合  计："]
["优惠价（含税、含运费、含安装调试）"]